DC stars
type: Concept
contributor: AAS Frey.Katie Admin
created: 2017-01-23T19:10:45Z
creator: AAS Frey.Katie
modified: 2020-11-04T21:15:00.38Z
modified: 2020-11-04T21:14:42.896Z
alternative label: DC white dwarf
alternative label: DC white dwarf stars
broader: White dwarf stars
definition: A white dwarf showing a continuous spectrum with no readily apparent lines.

White dwarf stars
type: Concept
narrower: DC stars