Primordial galaxies
type: Concept
contributor: AAS Frey.Katie Admin
modified: 2020-11-03T20:35:10.568Z
modified: 2020-11-03T20:34:58.401Z
broader: Galaxies
broader: Early universe
definition: A high redshift, metal-deficient galaxy that formed very early in the history of the Universe.

Early universe
type: Concept
narrower: Primordial galaxies

Galaxies
type: Concept
narrower: Primordial galaxies