Solar physics
type: Concept
narrower: Solar radius

Solar radius
type: Concept
contributor: AAS Frey.Katie Admin
contributor: AAS Frey.Katie
modified: 2020-11-24T17:16:11.6Z
modified: 2020-11-19T15:58:31.035Z
broader: Solar physics
definition: A unit of length, representing the radius of the Sun, used to express the size of stars in astrophysics. It is equivalent to: 695,700 km, 0.00465047 astronomical units, 7.35355 x 10^-8 light-years, and 2.32061 light-seconds.
related: Stellar radii

Stellar radii
type: Concept
related: Solar radius