Underabundances
type: Concept
contributor: AAS Frey.Katie Admin
modified: 2020-11-04T21:37:27.966Z
modified: 2020-11-04T21:37:16.143Z
broader: Chemical abundances
definition: The abundance of a chemical element being lower than a reference value, in particular compared to that of the Sun.

Chemical abundances
type: Concept
narrower: Underabundances