Astrostatistics techniques
type: Concept
narrower: Deconvolution

Deconvolution
type: Concept
contributor: AAS Frey.Katie
created: 2018-08-27T18:52:20Z
creator: AAS Frey.Katie
modified: 2020-11-03T20:03:33.126Z
modified: 2020-11-03T20:03:20.134Z
broader: Astrostatistics techniques
definition: A mathematical operation that allows to restore the original input signal, such as an astronomical image or spectrum, to its state before being affected by the atmospheric turbulence and the transfer function of the instrument.