Astrostatistics techniques
type: Concept
narrower: Detection

Detection
type: Concept
contributor: AAS Frey.Katie
created: 2018-08-27T18:52:24Z
creator: AAS Frey.Katie
modified: 2020-11-03T20:10:17.76Z
modified: 2020-11-03T20:10:27.386Z
broader: Astrostatistics techniques
definition: Any operation on an electrical or electromagnetic signal to recover information from it.