Rich galaxy clusters
type: Concept
contributor: AAS Frey.Katie Admin
created: 2018-08-29T14:45:08Z
creator: AAS Frey.Katie
modified: 2020-11-03T21:32:25.987Z
modified: 2020-11-03T21:32:40.913Z
alternative label: Rich clusters
broader: Galaxy clusters
definition: A galaxy cluster with a particularly large number of galaxies.

Galaxy clusters
type: Concept
narrower: Rich galaxy clusters