Occultation
type: Concept
narrower: Stellar occultation

Stellar occultation
type: Concept
contributor: AAS Frey.Katie Admin
created: 2019-12-11T20:43:13.625Z
creator: AAS Frey.Katie
modified: 2020-11-24T16:43:06.669Z
broader: Occultation
scope note: Occultation of a star by another object.