Nautical almanacs
type: Concept
broader: Almanacs

Almanacs
type: Concept
contributor: AAS Frey.Katie Admin
modified: 2020-11-04T22:11:15.186Z
modified: 2020-11-04T22:11:03.874Z
alternative label: Almanachs
broader: Astronomical reference materials
definition: A book of tables, usually covering a period of one calendar year, that lists the future positions of the Moon, planets, and other prominent celestial objects, together with other useful astronomical data.
narrower: Nautical almanacs

Astronomical reference materials
type: Concept
narrower: Almanacs