N galaxies
type: Concept
broader: Compact galaxies

Compact galaxies
type: Concept
contributor: AAS Frey.Katie
modified: 2020-10-26T20:21:36.236Z
modified: 2020-10-26T20:21:07.643Z
broader: Galaxies
definition: A galaxy with no disk or nebulous background and a high surface brightness that appears only barely larger than a star-like point on a sky survey photograph.
narrower: N galaxies

Galaxies
type: Concept
narrower: Compact galaxies