Amateur astronomers
type: Concept
contributor: AAS Frey.Katie
modified: 2020-10-26T18:38:17.565Z
modified: 2020-10-26T18:38:05.301Z
broader: Astronomical research
definition: A person who engages in astronomy as a pastime rather than as a profession.
related: Amateur astronomy

Amateur astronomy
type: Concept
related: Amateur astronomers

Astronomical research
type: Concept
narrower: Amateur astronomers