Planetary rings
type: Concept
narrower: Ansae

Ansae
type: Concept
contributor: AAS Frey.Katie
modified: 2020-10-26T18:42:23.848Z
modified: 2020-10-26T18:42:01.843Z
alternative label: Ansa
broader: Planetary rings
definition: The 'handles,' or extremities, of planetary rings, especially Saturn's, as viewed from Earth.