Orbital elements
type: Concept
narrower: Argument of perigee

Argument of perigee
type: Concept
contributor: AAS Frey.Katie
modified: 2020-11-03T18:18:35.994Z
modified: 2020-11-03T18:18:23.248Z
broader: Orbital elements
definition: The angular distance between the ascending node of an object orbiting the Earth and its perigee, measured from the Earth.