Origin of the universe
type: Concept
narrower: Hubble-Lemaitre law

Hubble diagram
type: Concept
broader: Hubble-Lemaitre law

Hubble-Lemaitre law
type: Concept
contributor: AAS Frey.Katie Admin
modified: 2020-11-02T17:00:19.079Z
modified: 2020-12-17T16:50:34.706Z
alternative label: Hubble law
alternative label: Hubble's law
broader: Origin of the universe
definition: The speed with which a galaxy cluster recedes from us is directly proportional to its distance. It can be stated as v = H_{0}d, where v is the recessional velocity, H_0 the Hubble-Lemaitre constant, and d the distance.
narrower: Hubble diagram