Orbital elements
type: Concept
narrower: Inclination

Inclination
type: Concept
contributor: AAS Frey.Katie
modified: 2020-11-09T16:57:07.932Z
modified: 2020-11-09T16:56:56.619Z
broader: Orbital elements
definition: An orbital element that defines the angle between the orbital plane of a solar system body (planet, comet, asteroid) and the plane of the ecliptic.