Interstellar emissions
type: Concept
narrower: Interstellar masers

Interstellar masers
type: Concept
contributor: AAS Frey.Katie Admin
modified: 2020-11-03T16:10:46.647Z
modified: 2020-11-03T16:10:34.062Z
broader: Interstellar emissions
definition: A maser phenomenon created by young stars and protostars in the surrounding dense molecular clouds of gas and dust.