Orbital motion
type: Concept
narrower: Keplerian orbit

Keplerian orbit
type: Concept
contributor: AAS Frey.Katie
modified: 2020-11-10T18:06:15.111Z
modified: 2020-11-10T18:06:05.101Z
broader: Orbital motion
definition: The orbit of a spherical object of a finite mass around another spherical object, also of finite mass, governed by their mutual gravitational forces only.