Space probes
type: Concept
narrower: Lunar probes

Lunar probes
type: Concept
contributor: AAS Frey.Katie Admin
modified: 2020-11-03T16:54:28.91Z
modified: 2020-11-03T16:54:16.301Z
broader: Space probes
definition: A probe for exploring and reporting on conditions on or about the Moon.
related: Lunar science

Lunar science
type: Concept
related: Lunar probes