ESA Data Ontology
type: ConceptScheme
type: Ontology

mission
type: ObjectProperty
type: Property
comment: The mission that a dcat:Resource is associated with. The mission is expressed as a skos:Concept.
domain: Resource
range: Concept