ESA Data Ontology
type: ConceptScheme
type: Ontology

isLeafConcept
definition: The :isLeafConcept property marks whether a SKOS concept is a leaf SKOS concept.

Hubble Space Telescope
type: Concept
modified: 2023-05-08T18:00:00+00:00
broader: Astronomy
definition: Launched in 1990, the NASA/ESA Hubble Space Telescope remains the premier UV and visible light telescope in orbit. With well over 1.4 million observations from 10 different scientific instruments, the ESA Hubble Science Archive is a treasure trove of astronomical data to be exploited.
in scheme: ESA Data Ontology
is leaf concept: true

Astronomy
type: Concept
type: NamedIndividual
narrower: Hubble Space Telescope
notation: missionsAstroSCI