ESA Data Ontology
type: ConceptScheme
type: Ontology

JWST
type: Concept
modified: 2023-05-08T18:00:00+00:00
broader: Astronomy
definition: The James Webb Space Telescope (JWST) is the largest optical or infrared observatory ever launched to space. Developed in a collaboration between NASA, ESA, and CSA, Webb observes the Universe in infrared light from its orbit at the Lagrangian point L2, 1.5 million km away from Earth.
in scheme: ESA Data Ontology

Astronomy
type: Concept
type: NamedIndividual
narrower: JWST
notation: missionsAstroSCI