ESA Data Ontology
type: ConceptScheme
type: Ontology

isLeafConcept
definition: The :isLeafConcept property marks whether a SKOS concept is a leaf SKOS concept.

Lisa Pathfinder
type: Concept
modified: 2023-05-08T18:00:00+00:00
broader: Astronomy
definition: LISA Pathfinder(LPF) is a European Space Agency mission launched on December 3, 2015 and dedicated to an end-to-end experimental demonstration of the free fall of two test masses at the level required for a future space-based gravitational wave observatory, such as LISA.
in scheme: ESA Data Ontology
is leaf concept: true

Astronomy
type: Concept
type: NamedIndividual
narrower: Lisa Pathfinder
notation: missionsAstroSCI