ESA Data Ontology
type: ConceptScheme
type: Ontology

isLeafConcept
definition: The :isLeafConcept property marks whether a SKOS concept is a leaf SKOS concept.

Planck
type: Concept
modified: 2023-05-08T18:00:00+00:00
broader: Astronomy
definition: Planck is ESA's mission to observe the first light in the Universe. Planck was selected in 1995 as the third Medium-Sized Mission (M3) of ESA's Horizon 2000 Scientific Programme, and later became part of its Cosmic Vision Programme. It was designed to image the temperature and polarization anisotropies of the Cosmic Background Radiation Field over the whole sky, with unprecedented sensitivity and angular resolution. Planck is testing theories of the early universe and the origin of cosmic structure and providing a major source of information relevant to many cosmological and astrophysical issues.
in scheme: ESA Data Ontology
is leaf concept: true

Astronomy
type: Concept
type: NamedIndividual
narrower: Planck
notation: missionsAstroSCI