CONVECTIVE PRECIPITATION
type: Concept
change note: 2020-05-20 13:44:57.0 [sritz] Insert Concept add broader relation (CONVECTIVE PRECIPITATION [001002d4-28ec-4ee2-9ff6-99d83be2d705,560173] - PRECIPITATION RATE [ac50c468-df2f-429c-8394-9d63efcc6f9d,86749]);
definition: The instantaneous convective precipitation rate at the surface
in scheme: sciencekeywords

PRECIPITATION RATE
type: Concept