FOODBORNE DISEASES
type: Concept
alternative label: FOODBORNE INFECTIONS
alternative label: FOODBORNE ILLNESSES
change note: 2019-07-15 12:29:48.0 [mmorahan] Rename Concept update PrefLabel (FOODBORNE DISEASES);
change note: 2019-07-15 12:27:02.0 [mmorahan] Insert Concept add broader relation (Foodborne Diseases [007eeff3-1c96-4b54-aa35-2de5ebb9971a,368963] - DISEASES/EPIDEMICS [7d59f070-ccac-4a90-815b-edfca521779b,84157]);
definition: Illness or disease caused by consumption of foods or drinks contaminated with biological or chemical toxins or pathogens, including disease-causing microbes or toxic chemicals.
in scheme: sciencekeywords

DISEASES/EPIDEMICS
type: Concept