MAIA-Sim
type: Concept
change note: 2022-08-16 11:33:15.0 [tstevens] insert AltLabel (id: null category: primary text: Multi-Angle Imager for Aerosols Simulated Data for Early Adopters language code: en); insert Definition (id: null text: The Multi-Angle Imager for Aerosols (MAIA) represents the first time NASA has partnered with epidemiologists and health organizations on a satellite mission to study human health and improve lives. Before launch, the MAIA team is working to test the software that will produce the MAIA data products and have generated simulated products in the same format as will be used during the actual mission. These simulated data products are available to MAIA Early Adopters, with the goal of facilitating the use of MAIA data post-launch. Early Adopters can determine whether the MAIA products contain the information needed for their work, and begin development of any code, tools, or procedures needed to integrate MAIA data into their workflow. Early Adopters are also invited to provide feedback to the MAIA project on the accessibility and usability of the MAIA data (obtaining the products, formats, content, available tools and user resources). language code: en);
change note: 2022-08-16 11:29:01.0 [tstevens] Insert Concept add broader relation (MAIA-Sim [00c3545f-06eb-427f-a11f-4a90459c8c1e,1026071] - M - O [a31c2828-9b6d-44e9-b6ad-7ae81030f322,1020041]);
definition: The Multi-Angle Imager for Aerosols (MAIA) represents the first time NASA has partnered with epidemiologists and health organizations on a satellite mission to study human health and improve lives. Before launch, the MAIA team is working to test the software that will produce the MAIA data products and have generated simulated products in the same format as will be used during the actual mission. These simulated data products are available to MAIA Early Adopters, with the goal of facilitating the use of MAIA data post-launch. Early Adopters can determine whether the MAIA products contain the information needed for their work, and begin development of any code, tools, or procedures needed to integrate MAIA data into their workflow. Early Adopters are also invited to provide feedback to the MAIA project on the accessibility and usability of the MAIA data (obtaining the products, formats, content, available tools and user resources).
in scheme: projects

M - O
type: Concept