POINT BAR
type: Concept
change note: 2013-08-15 12:58:26.0 [tbs1979] insert Definition (id: null text: A depositional feature of streams. Point bars are found in abundance in mature or meandering streams. language code: en);
change note: 2013-08-05 12:37:15.0 [tbs1979] Insert Concept add broader relation (POINT BAR [00e49fcb-d846-4b4e-8f45-b022c1713920,105327] - FLUVIAL LANDFORMS [bdc0bd86-a3a3-48fa-b1fb-4ca5d13d4dde,105281]);
definition: A depositional feature of streams. Point bars are found in abundance in mature or meandering streams.
in scheme: sciencekeywords

FLUVIAL LANDFORMS
type: Concept