Charts
type: Concept
change note: 2022-03-08 15:07:58.0 [tstevens] insert Definition (id: null text: A graphical representation for data visualization, in which data is represented by symbols, such as bars in a bar chart, lines in a line chart, or slices in a pie chart. A chart can represent tabular numeric data, functions or some kinds of quality structure and provides different info. language code: en);
change note: 2021-11-30 12:41:11.0 [tstevens] Insert Concept add broader relation (Charts [018e1ad9-a5ad-4fae-a712-ba376144fcc3,835909] - Other [5cd7da77-cb95-40aa-8775-b6df68e0aa63,835876]);
change note: 2021-11-30 12:42:14.0 [tstevens] Insert Concept add narrower relation (Charts [018e1ad9-a5ad-4fae-a712-ba376144fcc3,835909] - Charts [e9bd8b22-dc54-4bb5-b404-9ce41d7ac53d,835912]);
definition: A graphical representation for data visualization, in which data is represented by symbols, such as bars in a bar chart, lines in a line chart, or slices in a pie chart. A chart can represent tabular numeric data, functions or some kinds of quality structure and provides different info.
in scheme: platforms

Other
type: Concept

Charts
type: Concept