SULFUR DIOXIDE SURFACE
type: Concept
change note: 2021-03-03 09:13:04.0 [tstevens] insert Definition (id: null text: Acidic gas, formula SO2, formed in the combustion of many fuels and in the oxidation of naturally occurring sulfur gases measured at the earth's surface. It is the primary sulfur gas emitted from combustion sources and is a precursor to sulfuric acid, which is a major constituent of acid rain. language code: en);
change note: 2021-02-26 12:46:37.0 [tstevens] Insert Concept add broader relation (SULFUR DIOXIDE SURFACE [022f3225-3b23-4e56-a6ea-c21f08f9e179,560882] - SULFUR DIOXIDE [f5717312-c3ca-4492-a166-9f17c6d9b273,86733]);
definition: Acidic gas, formula SO2, formed in the combustion of many fuels and in the oxidation of naturally occurring sulfur gases measured at the earth's surface. It is the primary sulfur gas emitted from combustion sources and is a precursor to sulfuric acid, which is a major constituent of acid rain.
in scheme: sciencekeywords

SULFUR DIOXIDE
type: Concept