THEODOLITE
type: Concept
definition: A THEODOLITE is an optical instrument, similar to a surveyor?s transit telescope, used to visually track a radiosonde balloon and determine its azimuth and elevation angles while in flight.
in scheme: instruments

Photon/Optical Detectors
type: Concept