DOI/USGS/ASC/WR
type: Concept
change note: 2014-03-26 14:55:52.0 [epneff] Updated name update AltLabel (Water Resources of Alaska, Alaska Science Center, U.S. Geological Survey, U.S. Department of the Interior); update PrefLabel (DOI/USGS/ASC/WR);
definition: Welcome to the U.S. Geological Survey (USGS) Web page for the water resources of Alaska; this is your direct link to all kinds of water-resource information. Here you'll find information on Alaska's rivers and streams, ground water, water quality, and many other topics. The USGS operates the most extensive satellite network of stream-gaging stations in the state, many of which form the backbone of flood-warning systems.
in scheme: providers

USGS
type: Concept