OCEANIC ZONE
type: Concept
change note: 2016-06-14 11:41:22.0 [gee-cee] insert Definition (id: null text: Pertaining to open water beyond the continental shelves. language code: en);
change note: 2016-06-14 11:40:58.0 [gee-cee] Insert Concept add broader relation (OCEANIC ZONE [02d78090-d0b5-490d-92a8-b593172ab232,188239] - PELAGIC HABITAT [3d7ecc4f-e79e-40d1-8796-63059888bf5f,84265]);
definition: Pertaining to open water beyond the continental shelves.
in scheme: sciencekeywords

PELAGIC
type: Concept