HIAA
type: Concept
definition: Short Title: HIAA Proposal URL: http://classic.ipy.org/development/eoi/proposal-details.php?id=140 We propose to establish a program to investigate the interactions among aerosols, clouds and precipitation in the Arctic, and the impact of variations and changes in aerosol characteristics on precipitation, snow cover, river flow, permafrost and surface temperature. Observations of increasing precipitation, rising river flow, declining snow cover, and thawing permafrost indicate substantial changes to the Arctic hydrological cycle. Variations and changes in the Arctic hydrological cycle are likely to arise from a complex interplay between natural internal modes of climate variability and anthropogenic activity. Variations in atmospheric aerosol characteristics have the potential to modulate the Arctic hydrological cycle both directly through its impact on precipitation and also indirectly through its impact on temperature. Atmospheric aerosols influence the nucleation of cloud particles, which influences directly the cloud cover and precipitation processes, and hence forces variations in the river runoff, snow cover, permafrost, glacial accumulation, and surface temperature. Biomass burning in the northern forests, pollution aerosol, biogenic aerosol, and desert dust have been proposed as significant sources of Arctic aerosol. During the IPY, we will examine seasonal and regional variations, focusing on the North American Arctic and the Eurasian Arctic land regions. We will establish a multi-disciplinary observing network of atmospheric and surface hydrological observations, integrating existing observations (surface and satellite) and supplementing them with UAV measurements and enhanced surface observations during a special field campaign. Diagnostic and modeling studies will be conducted to document and understand the role of variations of aerosols in influencing variations of the Arctic hydrological cycle, towards predicting these variations and using these predic…
in scheme: projects

G - I
type: Concept