DOC/NOAA/NESDIS/NODC/OCL
type: Concept
change note: 2022-11-07 17:16:06.0 [sritz] update Definition (The NCEI Ocean Climate Laboratory Team (OCL) works to improve NCEI's oceanographic data archives through scientific analyses, developing and improving annual, seasonal, and monthly regional ocean climatologies, investigating interannual-to-decadal ocean climate variability, building scientifically, quality-controlled global oceanographic databases, and facilitating international exchange of oceanographic data.); update Definition (https://www.ncei.noaa.gov/products/ocean-climate-laboratory); update Resource (provider); update Resource (https://www.ncei.noaa.gov/products/ocean-climate-laboratory);
definition: The NCEI Ocean Climate Laboratory Team (OCL) works to improve NCEI's oceanographic data archives through scientific analyses, developing and improving annual, seasonal, and monthly regional ocean climatologies, investigating interannual-to-decadal ocean climate variability, building scientifically, quality-controlled global oceanographic databases, and facilitating international exchange of oceanographic data.
in scheme: providers

NOAA
type: Concept