F/V GREAT PACIFIC
type: Concept
change note: 2022-02-22 14:46:03.0 [tstevens] insert Definition (id: null text: A fishing vessel built in 1979 by MARINE INDUSTRIES NORTHWEST - TACOMA WA, U.S.A.. Currently sailing under the flag of United States (USA). It's gross tonnage is 199 tons. language code: en);
change note: 2021-11-18 09:34:38.0 [tstevens] Move Concepts delete broader relation (null); add broader relation (F/V GREAT PACIFIC [034a82a9-1dfc-4648-91fd-94aa6f8ed56f,825925] - Surface [59b97a6c-385e-40a2-8422-ecbdb6023c4c,835900]);
definition: A fishing vessel built in 1979 by MARINE INDUSTRIES NORTHWEST - TACOMA WA, U.S.A.. Currently sailing under the flag of United States (USA). It's gross tonnage is 199 tons.
in scheme: platforms

Surface
type: Concept