EASTERN PACIFIC OSCILLATION
type: Concept
change note: 2020-02-14 15:03:52.0 [tstevens] Remove Concepts delete narrower relation (null);
change note: 2012-06-25 10:38:23.0 [mpmorahan] Insert Concept add narrower relation (EASTERN PACIFIC OSCILLATION [0384fecd-9303-47f3-84e3-f01f58013fc3,23003] - EP/NP [334d9428-a178-4a5e-b758-a3675a122bef,39705]);
definition: The East Pacific - North Pacific (EP- NP) pattern is a Spring-Summer-Fall pattern with three main anomaly centers. The positive phase of this pattern features positive height anomalies located over Alaska/ Western Canada, and negative anomalies over the central North Pacific and eastern North America. Strong positive phases of the EP-NP pattern are associated with a southward shift and intensification of the Pacific jet stream from eastern Asia to the eastern North Pacific, followed downstream by an enhanced anticyclonic circulation over western North America, and by an enhanced cyclonic circulation over the eastern United States. Strong negative phases of the pattern are associated with circulation anomalies of opposite sign in these regions. The positive phase of the EP-NP pattern is associated with above-average surface temperatures over the eastern North Pacific, and below-average temperatures over the central North Pacific and eastern North America. The main precipitation anomalies associated with this pattern reflect above-average precipitation in the area north of Hawaii and below-average precipitation over southwestern Canada.
in scheme: sciencekeywords

TELECONNECTIONS
type: Concept