SWIMS
type: Concept
definition: The Solar Wind Ion Composition Spectrometer (SWICS) and the Solar Wind Ions Mass Spectrometer (SWIMS) instruments on the Advanced Composition Explorer (ACE) are optimized for measurements of the chemical and isotopic composition of solar and interstellar matter. Both instruments are time-of-flight mass spectrometers with electrostatic analyzers, though each is optimized for different measurements. SWICS determines the chemical and ionic charge state composition of the solar wind and resolves H and He isotopes of both solar and interstellar sources. SWICS also measures the distribution functions of both the interstellar cloud and dust cloud pickup ions up to energies of 100 keV/e. SWIMS measures the chemical and isotopic composition of the solar wind for every element between He and Ni, up to 10 keV/e. SWIMS and SWICS was designed and developed by the University of Michigan, Ann Arbor, Solar and Heliospheric Research Group. See: http://solar-heliospheric.engin.umich.edu/ace/ Group: Instrument_Details Entry_ID: SWIMS Group: Instrument_Identification Instrument_Category: Solar/Space Observing Instruments Instrument_Class: Particle Detectors Short_Name: SWIMS Long_Name: Solar Wind Ion Mass Spectrometer End_Group Group: Associated_Platforms Short_Name: ACE End_Group Online_Resource: http://solar-heliospheric.engin.umich.edu/ace/ Online_Resource: http://nssdc.gsfc.nasa.gov/database/MasterCatalog?sc=1997-045A&ex=1 Sample_Image: http://helios.gsfc.nasa.gov/ace/swims_sm.tif Group: Instrument_Logistics Data_Rate: 0.505 kbps Instrument_Start_Date: 1997-08-25 Instrument_Owner: University of Michigan, Ann Arbor End_Group End_Group
in scheme: instruments

Particle Detectors
type: Concept