ENVIRONMENTAL LAPSE RATE
type: Concept
change note: 2014-04-14 15:24:07.0 [128.183.164.42] added definition insert Definition (id: null text: The rate of decrease of air temperature with height, usually measured with a radiosonde. language code: en);
change note: 2013-09-04 14:48:35.0 [epneff] Insert Concept add broader relation (ENVIRONMENTAL LAPSE RATE [050771bb-27a3-4e47-bd1b-724d1d73e20c,105809] - VERTICAL PROFILES [72304037-ce59-451a-beeb-4258f3db296a,86067]);
definition: The rate of decrease of air temperature with height, usually measured with a radiosonde.
in scheme: sciencekeywords

VERTICAL PROFILES
type: Concept