GEOTHERMAL ENERGY PRODUCTION/USE
type: Concept
change note: 2012-06-29 13:45:46.0 [tbs1979] insert Definition (id: null text: Refers to the production and use of geothermal energy for human consumption. Geothermal energy is energy extracted from heat stored in the earth. This geothermal energy originates from the original formation of the planet, from radioactive decay of minerals, and from solar energy absorbed at the surface. language code: en);
change note: 2012-06-26 15:49:02.0 [tbs1979] Insert Concept add broader relation (GEOTHERMAL ENERGY PRODUCTION/USE [05410006-351a-4877-96e8-f0a821161ecf,40127] - ENERGY PRODUCTION/USE [b73cee46-8e2c-4df9-b1ed-7f0aa98a04ac,40101]);
definition: Refers to the production and use of geothermal energy for human consumption. Geothermal energy is energy extracted from heat stored in the earth. This geothermal energy originates from the original formation of the planet, from radioactive decay of minerals, and from solar energy absorbed at the surface.
in scheme: sciencekeywords

ENERGY PRODUCTION/USE
type: Concept