EARSC
type: Concept
change note: 2021-08-09 12:51:00.0 [mmorahan] Insert Concept add broader relation (EARSC [05c52cf9-0bb3-490f-a62d-f86816b0b24a,706560] - MULTINATIONAL ORGANIZATIONS [756a90f8-4203-46f1-87e9-9e0d64bdee50,693038]);
change note: 2021-08-09 12:57:39.0 [mmorahan] insert AltLabel (id: null category: primary text: European Association of Remote Sensing language code: en); insert Definition (id: null text: EARSC, the European Association of Remote Sensing Companies, is a membership-based, not for profit organisation which coordinates and promotes the activities of European companies engaged in delivering Earth observation-derived geo-information services. EARSC represents this sector in its broadest sense, creating a network between industry, decision makers and users and covering the full EO value chain from data acquisition through processing, fusion, analysis to final geo-information products & services. language code: en); insert Resource (id: null type: provider url: https://earsc.org/);
definition: EARSC, the European Association of Remote Sensing Companies, is a membership-based, not for profit organisation which coordinates and promotes the activities of European companies engaged in delivering Earth observation-derived geo-information services. EARSC represents this sector in its broadest sense, creating a network between industry, decision makers and users and covering the full EO value chain from data acquisition through processing, fusion, analysis to final geo-information products & services.
in scheme: providers

MULTINATIONAL ORGANIZATIONS
type: Concept