TOWSON-U/CSM
type: Concept
definition: Founded in 1866, Towson University is recognized among the nation's best regional public universities, offering more than 100 bachelor's, master's and doctoral degree programs in the liberal arts and sciences, and applied professional fields. Located in suburban Towson, eight miles north of Baltimore, our beautifully landscaped, 328-acre setting offers a pleasant environment for study and a diverse campus life, as well as easy access to a wealth of university and community resources. With nearly 20,000 students, Towson University is the second-largest public university in Maryland. As a metropolitan university, Towson combines research-based learning with practical application. Our many interdisciplinary partnerships with public and private organizations throughout Maryland provide opportunities for research, internships and jobs. Towson University is a founding member of the Coalition of Urban and Metropolitan Universities (CUMU); TU President Robert Caret holds the office of president. Summary Provided By: http://www.towson.edu/main/abouttu/
in scheme: providers

ACADEMIC
type: Concept