USDA/ARS/LARRL
type: Concept
definition: The mission of the Livestock and Range Research Laboratory is to research and develop ecologically and economically sustainable range animal management systems that ultimately meet consumers needs. Website: "http://www.larrl.ars.usda.gov/" [Summary provided by the USDA.]
in scheme: providers

USDA
type: Concept