PISTON
type: Concept
change note: 2020-07-02 16:38:04.0 [sritz] Insert Concept add broader relation (PISTON [06e9cf54-c97d-4e49-9810-5f8cc4812757,560514] - P - R [6e0ee015-7fde-40bf-af5a-5b95ad966e32,547935]);
change note: 2020-07-02 16:40:01.0 [sritz] insert Definition (id: null text: [Source: https://onrpiston.colostate.edu/about.html ] PISTON stands for the Propagation of Intra-Seasonal Tropical OscillatioNs. While numerous tropical intra-seasonal oscillations exist, PISTON will primarily target the Boreal Summer Intraseasonal Oscillation (BSISO). The BSISO defines the northward and eastward movement of the Asian monsoon during northern-hemispheric (boreal) summertime. This oscillation has been observed to impact weather across the Maritime Continent and into the southeastern portions of continental Asia, and even weather within the United States. The BSISO is rather complex, and PISTON is therefore an extensive field campaign, involving both intensive numerical modeling and observational activities. Namely, the PISTON campaign emphasizes two scientific questions: How do localized features such as island orography and individual thunderstorms influence tropical intraseasonal oscillations? language code: en);
change note: 2020-07-02 16:38:39.0 [sritz] insert AltLabel (id: null category: primary text: Propagation of Intra-Seasonal Tropcial OscillatioNs language code: en);
definition: [Source: https://onrpiston.colostate.edu/about.html ] PISTON stands for the Propagation of Intra-Seasonal Tropical OscillatioNs. While numerous tropical intra-seasonal oscillations exist, PISTON will primarily target the Boreal Summer Intraseasonal Oscillation (BSISO). The BSISO defines the northward and eastward movement of the Asian monsoon during northern-hemispheric (boreal) summertime. This oscillation has been observed to impact weather across the Maritime Continent and into the southeastern portions of continental Asia, and even weather within the United States. The BSISO is rather complex, and PISTON is therefore an extensive field campaign, involving both intensive numerical modeling and observational activities. Namely, the PISTON campaign emphasizes two scientific questions: How do localized features such as island orography and individual thunderstorms influence tropical intraseasonal oscillations?
in scheme: projects

P - R
type: Concept