FDSN
type: Concept
change note: 2022-02-08 09:39:03.0 [tstevens] update Definition (The Federation of Digital Broad-Band Seismograph Networks (FDSN) is a global organization. Its membership is comprised of groups responsible for the installation and maintenance of broad-band seismographs either within their geographic borders or globally. Membership in the FDSN is open to all organizations that operate more than one broadband station. Members agree to coordinate station siting and provide free and open access to their data. This cooperation helps scientists all over the world to further the advancement of earth science and particularly the study of global seismic activity.); update Resource (image);
change note: 2021-11-17 13:56:25.0 [tstevens] Move Concepts delete broader relation (null); add broader relation (FDSN [0768c45e-417b-4c35-aeb3-28e4325ef2d2,825945] - Permanent Land Sites [0ec10fd9-492c-498a-b6d8-e2840cc3643b,835887]);
definition: The Federation of Digital Broad-Band Seismograph Networks (FDSN) is a global organization. Its membership is comprised of groups responsible for the installation and maintenance of broad-band seismographs either within their geographic borders or globally. Membership in the FDSN is open to all organizations that operate more than one broadband station. Members agree to coordinate station siting and provide free and open access to their data. This cooperation helps scientists all over the world to further the advancement of earth science and particularly the study of global seismic activity.
in scheme: platforms

Permanent Land Sites
type: Concept