ARGENTINA
type: Concept

AR/CREDAS
type: Concept
definition: CREDAS - Centro Regional de Datos Satelitales (Regional Satellite Data Center) Mother Intitution: CONAE - Comision Nacional de Actividades Espaciales (Argentine Space Agency) Address: Paseo Colon 751 C1063ACH Buenos Aires Argentina Phone: +54-11-4331-0074 x321 FAX: +54-11-4331-0074 x333 URL: "http://www.conae.gov.ar/credas.html" Personnel: 7
in scheme: providers