LAGOONS
type: Concept
change note: 2013-03-29 10:31:37.0 [tbs1979] insert Definition (id: null text: A body of shallow sea water or brackish water separated from the sea by some form of barrier. language code: en);
change note: 2013-02-18 14:15:39.0 [tbs1979] Insert Concept add broader relation (LAGOONS [081d131a-6bef-47dc-adb3-f96da9123f93,82603] - COASTAL LANDFORMS [c58320e6-3f1d-4c36-9bee-6bad73404c21,62739]);
definition: A body of shallow sea water or brackish water separated from the sea by some form of barrier.
in scheme: sciencekeywords

COASTAL LANDFORMS
type: Concept