Distance Sampling
type: Concept
change note: 2021-10-07 08:55:14.0 [tstevens] insert Definition (id: null text: A set of randomly placed lines or points is established and distances are measured to those objects detected by traveling the line or surveying the points. language code: en);
change note: 2021-10-07 08:53:49.0 [tstevens] Insert Concept add broader relation (Distance Sampling [092cad6c-758d-4d0b-b615-615fc42e08b5,763844] - Samplers [78c70202-ab05-40d6-90db-563be2a8dc90,755815]);
definition: A set of randomly placed lines or points is established and distances are measured to those objects detected by traveling the line or surveying the points.
in scheme: instruments

Samplers
type: Concept