EL NINO SOUTHERN OSCILLATION (ENSO)
type: Concept
change note: 2020-02-14 15:04:05.0 [tstevens] Remove Concepts delete narrower relation (null);
change note: 2012-06-25 10:41:12.0 [mpmorahan] MMORAHAN 20120625 - ADDED ENSO TO KEYWORD update PrefLabel (EL NINO SOUTHERN OSCILLATION (ENSO));
change note: 2012-06-25 10:39:07.0 [mpmorahan] Insert Concept add narrower relation (EL NINO SOUTHERN OSCILLATION [095a05c0-6220-4abd-9c1b-c4504a092d7d,22987] - ENSO [54330626-f9b4-4c34-949a-9be427fdf51b,39707]);
definition: An irregular variation of ocean current that from January to March flows off the west coast of South America, carrying warm, low-salinity, nutrient-poor water to the south. It does not usually extend farther than a few degrees south of the equator, but occasionally it does penetrate beyond 12 degrees S, displacing the relatively cold Peru Current. The effects of this phenomenon are generally short-lived, and fishing is only slightly disrupted. Occasionally (in 1891, 1925, 1941, 1957 - 58, 1965, 1972 - 73, 1976, and 1982 - 83), the effects are major and prolonged. Under these conditions, sea surface temperatures rise along the coast of Peru and in the equatorial eastern Pacific Ocean and may remain high for more than a year, having disastrous effects on marine life and fishing. Excessive rainfall and flooding occur in the normally dry coastal area of western tropical South America during these events. Some oceanographers and meteorologists consider only the major, prolonged events as El Nino phenomena rather than the annually occurring weaker and short-lived ones. The name was originally applied to the latter events because of their occurrence at Christmas time. ("http://cdiac.esd.ornl.gov/glossary.html") Interacting parts of a single global system of climate fluctuations. ENSO is the most prominent known source of interannual variability in weather and climate around the world, though not all areas are affected. The Southern Oscillation (SO) is a global-scale seesaw in atmospheric pressure between Indonesia/North Australia, and the southeast Pacific. In major warm events El Nino warming extends over much of the tropical Pacific and becomes clearly linked to the SO pattern. Many of the countries most affected by ENSO events are developing countries with economies that are largely dependent upon their agricultural and fishery sectors as a major source of food supply, employment, and foreign exchange. New capabilities to predict the onset of ENSO event can have a globa…
in scheme: sciencekeywords

TELECONNECTIONS
type: Concept