PERIGLACIAL PROCESSES
type: Concept
definition: Of, or pertaining to, the outer perimeter of a glacier, particularly to the fringe areas surrounding the great continental glaciers of the geologic ice ages. Thus, periglacial weathering is said to have produced certain characteristic land forms.
in scheme: sciencekeywords

FROZEN GROUND
type: Concept