CHA
type: Concept
definition: The Canadian Healthcare Association - advocating for health policy solutions that meet the needs of Canadians Welcome to the Canadian Healthcare Association website. We have recently restructured our website to allow users to learn more about CHA and its members, to contact key departments and services, and to ensure efficient and quick access to resources such as Resource Digest, policy briefs, and press releases and media advisories. CHA partners with several national organizations to produce high quality and informative professional development opportunities. Please visit Events to learn more about the 2009 CNIE International Conference and the National Healthcare Leadership Conference 2009. Information provided by http://www.cha.ca/index.php?option=com_content&view=article&id=6&Itemid=1
in scheme: providers

CONSORTIA/INSTITUTIONS
type: Concept